{"text_format":"1","workbook":"xlsx","n_sheets":10,"sheets":["Main","GrainBill","HopSchedule","Adjuncts","Refractometer","BatchAnalytics","Catalog","Constants","Scratch","Mash"],"not_rendered":{"charts":0,"images":0,"macros":1,"external_links":0,"defined_names":30,"comments":2,"pivot_tables":0},"unopened":[],"bounds":{"document_bytes":16777216,"sheet_cells":100000,"rows_first":2000,"rows_last":500,"rows_between":2000,"halvings":0,"cell_chars":16384,"cell_head_chars":4096},"cells_cut":0,"cells_raw":0,"read":"whole","date_system":"1900"}

{"sheet":"Main","index":0,"n_rows":61,"n_cols":6,"rows_kept":61,"cut":false,"hidden":false,"merged":[[52,0,53,0],[56,0,56,5],[57,0,58,0],[38,0,38,1],[38,3,38,5],[42,3,42,4],[46,0,46,5],[47,0,48,0],[51,0,51,5],[32,0,32,5],[7,1,7,5],[9,2,9,3],[26,4,26,5],[27,4,27,5],[28,4,28,5],[29,4,29,5],[13,0,13,1],[9,0,9,1],[10,0,10,1],[11,0,11,1],[12,0,12,1],[10,2,10,3],[11,2,11,3],[12,2,12,3],[13,2,13,3],[0,0,0,5],[8,0,8,5],[1,1,1,5],[2,1,2,5],[5,1,5,5],[6,1,6,5],[3,0,4,0],[3,1,3,2],[4,1,4,2],[14,2,14,3],[17,1,17,2],[18,1,18,2],[19,1,19,2],[14,0,14,1],[15,0,15,1],[15,2,15,3],[16,0,16,2],[16,3,16,5],[30,4,30,5],[31,4,31,5],[21,1,21,2],[17,3,17,4],[18,3,18,4],[19,3,19,4],[20,3,20,4],[21,3,21,4],[20,1,20,2],[23,4,23,5],[24,4,24,5],[25,4,25,5],[22,0,22,5]]}
["Batch Description"]
["Beer Type","Double IPA"]
["Beer Recipe Name","Wicked Angel DIPA"]
["Yeast Type","California Ale Yeast",null,{"$f":"IF(ISBLANK(B4),\"\",VLOOKUP(B4,Yeast_Table,2,FALSE))","v":"WLP001"},{"$f":"IF(ISBLANK(B4),\"\",VLOOKUP(B4,Yeast_Table,5,FALSE) &\" : \" & VLOOKUP(B4,Yeast_Table,4,FALSE))","v":"Liquid : ALE"},{"$f":"IF(ISBLANK(B4),\"\",VLOOKUP(B4,Yeast_Table,6,FALSE))","v":5.65}]
[null,"Dry English Ale Yeast",null,{"$f":"IF(ISBLANK(B5),\"\",VLOOKUP(B5,Yeast_Table,2,FALSE))","v":"WLP007"},{"$f":"IF(ISBLANK(B5),\"\",VLOOKUP(B5,Yeast_Table,5,FALSE) &\" : \" & VLOOKUP(B5,Yeast_Table,4,FALSE))","v":"Liquid : ALE"},{"$f":"IF(ISBLANK(B5),\"\",VLOOKUP(B5,Yeast_Table,6,FALSE))","v":5.65}]
["Boil Size (gal)",12]
["Batch Size (gal)",10]
["Mash temperature (F)",150]
["Primary Grains, Malts and Boil Adjuncts"]
["Name",null,"Amount (lbs)",null,"Bill %","SRMg (Grain)"]
[{"$f":"IF(ISBLANK(GrainBill!B3),\"\",GrainBill!B3)","v":"American 2-Row Barley"},null,{"$f":"IF(ISBLANK(GrainBill!B3),\"\",GrainBill!C3)","v":23},null,{"$f":"IF(ISBLANK(GrainBill!B3),\"\",GrainBill!D3)","v":0.92929292929292928},{"$f":"IF(ISBLANK(GrainBill!B3),\"\",GrainBill!E3)","v":3}]
[{"$f":"IF(ISBLANK(GrainBill!B4),\"\",GrainBill!B4)","v":"Carastan (Crystal), 15"},null,{"$f":"IF(ISBLANK(GrainBill!B4),\"\",GrainBill!C4)","v":1.5},null,{"$f":"IF(ISBLANK(GrainBill!B4),\"\",GrainBill!D4)","v":6.0606060606060608E-2},{"$f":"IF(ISBLANK(GrainBill!B4),\"\",GrainBill!E4)","v":15}]
[{"$f":"IF(ISBLANK(GrainBill!B5),\"\",GrainBill!B5)","v":"Wheat Malt (GWM)"},null,{"$f":"IF(ISBLANK(GrainBill!B5),\"\",GrainBill!C5)","v":0.25},null,{"$f":"IF(ISBLANK(GrainBill!B5),\"\",GrainBill!D5)","v":1.0101010101010102E-2},{"$f":"IF(ISBLANK(GrainBill!B5),\"\",GrainBill!E5)","v":3}]
[{"$f":"IF(ISBLANK(GrainBill!B6),\"\",GrainBill!B6)","v":"American 2-Row Barley"},null,{"$f":"IF(ISBLANK(GrainBill!B6),\"\",GrainBill!C6)","v":0},null,{"$f":"IF(ISBLANK(GrainBill!B6),\"\",GrainBill!D6)","v":0},{"$f":"IF(ISBLANK(GrainBill!B6),\"\",GrainBill!E6)","v":3}]
[{"$f":"IF(ISBLANK(GrainBill!B7),\"\",GrainBill!B7)","v":""},null,{"$f":"IF(ISBLANK(GrainBill!B7),\"\",GrainBill!C7)","v":""},null,{"$f":"IF(ISBLANK(GrainBill!B7),\"\",GrainBill!D7)","v":""},{"$f":"IF(ISBLANK(GrainBill!B7),\"\",GrainBill!E7)","v":""}]
[{"$f":"IF(ISBLANK(GrainBill!B8),\"\",GrainBill!B8)","v":""},null,{"$f":"IF(ISBLANK(GrainBill!B8),\"\",GrainBill!C8)","v":""},null,{"$f":"IF(ISBLANK(GrainBill!B8),\"\",GrainBill!D8)","v":""},{"$f":"IF(ISBLANK(GrainBill!B8),\"\",GrainBill!E8)","v":""}]
["Post Boil Fermentable Sugar Adjuncts",null,null,"Non-Fermentable Sugar Adjuncts"]
["Name","Amount (lbs)",null,"Name",null,"Amount (lbs)"]
[{"$f":"IF(ISBLANK(Adjuncts!A3),\"\",Adjuncts!A3)","v":"Corn Sugar"},{"$f":"IF(ISBLANK(Adjuncts!A3),\"\",Adjuncts!C3)","v":1.5},null,{"$f":"IF(ISBLANK(Adjuncts!A9),\"\",Adjuncts!A9)","v":""},null,{"$f":"IF(ISBLANK(Adjuncts!A9),\"\",Adjuncts!C9)","v":""}]
[{"$f":"IF(ISBLANK(Adjuncts!A4),\"\",Adjuncts!A4)","v":""},{"$f":"IF(ISBLANK(Adjuncts!A4),\"\",Adjuncts!C4)","v":""},null,{"$f":"IF(ISBLANK(Adjuncts!A10),\"\",Adjuncts!A10)","v":""},null,{"$f":"IF(ISBLANK(Adjuncts!A10),\"\",Adjuncts!C10)","v":""}]
{"$rows_left_out":42}
{"sheet":"GrainBill","index":1,"n_rows":31,"n_cols":17,"rows_kept":31,"cut":false,"hidden":false,"merged":[[0,0,0,10],[1,12,1,13],[1,14,1,16],[5,14,5,15]]}
["Grains and Malts"]
["Line","Name","Amount (lbs)","Bill %","SRMg (Grain)","SRMext","Unit Gravity","Gravity Yield","Gravity","price / lb","ext",null,{"$f":"Main!A39","v":"Key Parameters"},{"$f":"Main!B39","v":0},{"$f":"Main!D39","v":"Est. Sugar Composition"},{"$f":"Main!E39","v":0},{"$f":"Main!F39","v":0}]
[1,"American 2-Row Barley",23,{"$f":"IF(ISBLANK(B3),\"\",C3/$C$31)","v":0.92929292929292928},{"$f":"IF(ISBLANK(B3)=FALSE,VLOOKUP(B3,GrainsAndMalts_Table,4,0),0)","v":3},{"$f":"C3*E3","v":69},{"$f":"IF(ISBLANK(B3)=FALSE,VLOOKUP(B3,GrainsAndMalts_Table,3,0),0)","v":1.0369999999999999},{"$f":"IF(G3>1,(G3-1)*BrewhouseEfficiency,0)","v":2.5011999999999954E-2},{"$f":"C3*(H3)","v":0.5752759999999989},{"$f":"IF(ISBLANK(B3)=FALSE,VLOOKUP(B3,GrainsAndMalts_Table,2,0),0)","v":1.0900000000000001},{"$f":"C3*J3","v":25.07},null,{"$f":"Main!A40","v":"Boil Gravity"},{"$f":"Main!B40","v":1.0619046999999999},{"$f":"Main!D40","v":"Dextrose"},null,{"$f":"Main!F40","v":0.41584094752435008}]
[2,"Carastan (Crystal), 15",1.5,{"$f":"IF(ISBLANK(B4),\"\",C4/$C$31)","v":6.0606060606060608E-2},15,{"$f":"C4*E4","v":22.5},1.0369999999999999,2.5011999999999954E-2,{"$f":"C4*(H4)","v":3.7517999999999933E-2},1.61,{"$f":"C4*J4","v":2.415},null,{"$f":"Main!A41","v":"SGs"},{"$f":"Main!B41","v":1.0686547},{"$f":"Main!D41","v":"Maltose"},null,{"$f":"Main!F41","v":0.41584094752435008}]
[3,"Wheat Malt (GWM)",0.25,1.0101010101010102E-2,3,0.75,1.0369999999999999,2.5011999999999954E-2,6.2529999999999886E-3,1.0900000000000001,0.27250000000000002,null,{"$f":"Main!A42","v":"SGf"},{"$f":"Main!B42","v":1.012},{"$f":"Main!D42","v":"Simple Sugars"},null,{"$f":"Main!F42","v":0.16831810495129979}]
[4,"American 2-Row Barley",0,0,3,0,1.0369999999999999,2.5011999999999954E-2,0,1.0900000000000001,0,null,{"$f":"Main!A43","v":"SRMb"},{"$f":"Main!B43","v":6.8501088429244907},{"$f":"Main!D43","v":"Other Non-Fermentable Sugars"},{"$f":"Main!E43","v":0},{"$f":"Main!F43","v":0}]
[5,null,null,"",0,0,0,0,0,0,0,null,{"$f":"Main!A44","v":"IBU"},{"$f":"Main!B44","v":67.902567605776866}]
[6,null,null,"",0,0,0,0,0,0,0,null,{"$f":"Main!A45","v":"% ABV (Miller)"},{"$f":"Main!B45","v":7.5539599999999929E-2}]
[7,null,null,"",0,0,0,0,0,0,0]
[8,null,null,"",0,0,0,0,0,0,0]
[9,null,null,"",0,0,0,0,0,0,0]
[10,null,null,"",0,0,0,0,0,0,0]
[11,null,null,"",0,0,0,0,0,0,0]
[12,null,null,"",0,0,0,0,0,0,0]
[13,null,null,"",0,0,0,0,0,0,0]
[14,null,null,"",0,0,0,0,0,0,0]
[15,null,null,"",0,0,0,0,0,0,0]
[16,null,null,"",0,0,0,0,0,0,0]
[17,null,null,"",0,0,0,0,0,0,0]
[18,null,null,"",0,0,0,0,0,0,0]
{"$rows_left_out":12}
{"sheet":"HopSchedule","index":2,"n_rows":19,"n_cols":14,"rows_kept":19,"cut":false,"hidden":false,"merged":[[0,0,0,13],[18,0,18,4],[18,6,18,11]]}
["Boil Additions"]
["Line","Hops Type","Alpha Acid Content","Amount (oz)","Boil Time","IBU Contribution","AAU","Utilization","Scheduled Addition Time","Action","Completed","Status","price / oz","ext"]
[1,"Centennial",{"$f":"IF(ISBLANK(B3)=FALSE,VLOOKUP(B3,Hops_Table,3,FALSE),0)","v":0.08},0,60,{"$f":"G3*H3*75/Main!$B$7","v":0},{"$f":"D3*C3*100","v":0},{"$f":"(1.65*0.000125^((Main!$B$41-1)*(Main!$B$7/Main!$B$6)))*((1-EXP(-0.04*E3))/4.15)","v":0.21618716364046717},"2011-12-31T16:03:18",{"$f":"IF(ISBLANK(B3)=FALSE,IF(NOW()>I3, \"Add\", \"Wait\"),\"\")","v":"Add"},"x",{"$f":"IF(ISBLANK(B3)=FALSE,IF(J3=\"Add\",IF(ISBLANK(K3)=TRUE, 2,0),1),\"\")","v":0},{"$f":"IF(ISBLANK(B3)=FALSE,VLOOKUP(B3,Hops_Table,2,0),0)","v":0.671875},{"$f":"M3*D3","v":0}]
[2,"Palisade",7.2999999999999995E-2,4,60,{"$f":"G4*H4*75/Main!$B$7","v":47.344988837262306},29.2,{"$f":"(1.65*0.000125^((Main!$B$41-1)*(Main!$B$7/Main!$B$6)))*((1-EXP(-0.04*E4))/4.15)","v":0.21618716364046717},{"$f":"IF(ISBLANK(B4),\"\",$I$3+($E$3-E4)/24/60)","v":40908.668958333335},{"$f":"IF(ISBLANK(B4)=FALSE,IF(NOW()>I4, \"Add\", \"Wait\"),\"\")","v":"Add"},"x",{"$f":"IF(ISBLANK(B4)=FALSE,IF(J4=\"Add\",IF(ISBLANK(K4)=TRUE, 2,0),1),\"\")","v":0},0.55000000000000004,2.2000000000000002]
[3,"Palisade",{"$f":"IF(ISBLANK(B5)=FALSE,VLOOKUP(B5,Hops_Table,3,FALSE),0)","v":7.2999999999999995E-2},1,30,{"$f":"G5*H5*75/Main!$B$7","v":9.096449323980103},7.3,{"$f":"(1.65*0.000125^((Main!$B$41-1)*(Main!$B$7/Main!$B$6)))*((1-EXP(-0.04*E5))/4.15)","v":0.1661451931320567},{"$f":"IF(ISBLANK(B5),\"\",$I$3+($E$3-E5)/24/60)","v":40908.689791666671},{"$f":"IF(ISBLANK(B5)=FALSE,IF(NOW()>I5, \"Add\", \"Wait\"),\"\")","v":"Add"},"x",0,0.55000000000000004,0.55000000000000004]
[4,"Cascade (U.S.)",{"$f":"IF(ISBLANK(B6)=FALSE,VLOOKUP(B6,Hops_Table,3,FALSE),0)","v":5.4000000000000006E-2},1,30,{"$f":"G6*H6*75/Main!$B$7","v":6.7288803218482967},5.4,{"$f":"(1.65*0.000125^((Main!$B$41-1)*(Main!$B$7/Main!$B$6)))*((1-EXP(-0.04*E6))/4.15)","v":0.1661451931320567},40908.689791666671,"Add","x",0,0.546875,0.546875]
[5,"Cascade (U.S.)",5.4000000000000006E-2,2,2,{"$f":"G7*H7*75/Main!$B$7","v":1.4806428701353824},10.8,{"$f":"(1.65*0.000125^((Main!$B$41-1)*(Main!$B$7/Main!$B$6)))*((1-EXP(-0.04*E7))/4.15)","v":1.8279541606609658E-2},40908.709236111114,"Add",null,2,0.546875,1.09375]
[6,"Palisade",7.2999999999999995E-2,3,2,{"$f":"G8*H8*75/Main!$B$7","v":3.0024147088856363},21.9,{"$f":"(1.65*0.000125^((Main!$B$41-1)*(Main!$B$7/Main!$B$6)))*((1-EXP(-0.04*E8))/4.15)","v":1.8279541606609658E-2},40908.709236111114,"Add",null,2,0.55000000000000004,1.6500000000000001]
[7,"Cascade (U.S.)",5.4000000000000006E-2,0.66,1,{"$f":"G9*H9*75/Main!$B$7","v":0.24919154366514248},3.5640000000000005,{"$f":"(1.65*0.000125^((Main!$B$41-1)*(Main!$B$7/Main!$B$6)))*((1-EXP(-0.04*E9))/4.15)","v":9.3225418505477921E-3},40908.70993055556,"Add",null,2,0.546875,0.36093750000000002]
[8,null,0,null,null,{"$f":"G10*H10*75/Main!$B$7","v":0},0,{"$f":"(1.65*0.000125^((Main!$B$41-1)*(Main!$B$7/Main!$B$6)))*((1-EXP(-0.04*E10))/4.15)","v":0},"","",null,"",0,0]
[9,null,0,null,null,{"$f":"G11*H11*75/Main!$B$7","v":0},0,{"$f":"(1.65*0.000125^((Main!$B$41-1)*(Main!$B$7/Main!$B$6)))*((1-EXP(-0.04*E11))/4.15)","v":0},"","",null,"",0,0]
[10,null,0,null,null,{"$f":"G12*H12*75/Main!$B$7","v":0},0,{"$f":"(1.65*0.000125^((Main!$B$41-1)*(Main!$B$7/Main!$B$6)))*((1-EXP(-0.04*E12))/4.15)","v":0},"","",null,"",0,0]
[11,null,0,null,null,{"$f":"G13*H13*75/Main!$B$7","v":0},0,{"$f":"(1.65*0.000125^((Main!$B$41-1)*(Main!$B$7/Main!$B$6)))*((1-EXP(-0.04*E13))/4.15)","v":0},"","",null,"",0,0]
[12,null,0,null,null,{"$f":"G14*H14*75/Main!$B$7","v":0},0,{"$f":"(1.65*0.000125^((Main!$B$41-1)*(Main!$B$7/Main!$B$6)))*((1-EXP(-0.04*E14))/4.15)","v":0},"","",null,"",0,0]
[13,null,0,null,null,{"$f":"G15*H15*75/Main!$B$7","v":0},0,{"$f":"(1.65*0.000125^((Main!$B$41-1)*(Main!$B$7/Main!$B$6)))*((1-EXP(-0.04*E15))/4.15)","v":0},"","",null,"",0,0]
[14,null,0,null,null,{"$f":"G16*H16*75/Main!$B$7","v":0},0,{"$f":"(1.65*0.000125^((Main!$B$41-1)*(Main!$B$7/Main!$B$6)))*((1-EXP(-0.04*E16))/4.15)","v":0},"","",null,"",0,0]
[15,null,0,null,null,{"$f":"G17*H17*75/Main!$B$7","v":0},0,{"$f":"(1.65*0.000125^((Main!$B$41-1)*(Main!$B$7/Main!$B$6)))*((1-EXP(-0.04*E17))/4.15)","v":0},"","",null,"",0,0]
[16,null,0,null,null,{"$f":"G18*H18*75/Main!$B$7","v":0},0,{"$f":"(1.65*0.000125^((Main!$B$41-1)*(Main!$B$7/Main!$B$6)))*((1-EXP(-0.04*E18))/4.15)","v":0},"","",null,"",0,0]
["Total IBU",null,null,null,null,{"$f":"SUM(F3:F18)","v":67.902567605776866},null,null,null,null,null,null,"Total",{"$f":"SUM(N3:N18)","v":6.4015625000000007}]

{"sheet":"Adjuncts","index":3,"n_rows":14,"n_cols":16,"rows_kept":14,"cut":false,"hidden":false,"merged":[[0,0,0,7],[1,11,1,12],[1,13,1,15],[5,13,5,14],[6,0,6,7]]}
["Post Boil Fermentable Sugar Adjuncts"]
["Name","Unit Gravity","Amount (lbs)","SRMg","SRMext","Gravity","price / lb","ext",null,null,null,{"$f":"Main!A39","v":"Key Parameters"},{"$f":"Main!B39","v":0},{"$f":"Main!D39","v":"Est. Sugar Composition"},{"$f":"Main!E39","v":0},{"$f":"Main!F39","v":0}]
["Corn Sugar",{"$f":"IF(ISBLANK(A3)=FALSE,VLOOKUP(A3,Adjunct_Table,3,FALSE),0)","v":1.0449999999999999},1.5,{"$f":"IF(ISBLANK(A3)=FALSE,VLOOKUP(A3,Adjunct_Table,4,FALSE),0)","v":1},{"$f":"IF(ISBLANK(A3),0,C3*D3)","v":1.5},{"$f":"IF(ISBLANK(A3),0,C3*(B3-1))","v":6.7499999999999893E-2},{"$f":"IF(ISBLANK(A3)=FALSE,VLOOKUP(A3,Adjunct_Table,2,FALSE),0)","v":1.18},{"$f":"C3*G3","v":1.77},null,null,null,{"$f":"Main!A40","v":"Boil Gravity"},{"$f":"Main!B40","v":1.0619046999999999},{"$f":"Main!D40","v":"Dextrose"},null,{"$f":"Main!F40","v":0.41584094752435008}]
[null,{"$f":"IF(ISBLANK(A4)=FALSE,VLOOKUP(A4,Adjunct_Table,3,FALSE),0)","v":0},null,{"$f":"IF(ISBLANK(A4)=FALSE,VLOOKUP(A4,Adjunct_Table,4,FALSE),0)","v":0},{"$f":"IF(ISBLANK(A4),0,C4*D4)","v":0},{"$f":"IF(ISBLANK(A4),0,C4*(B4-1))","v":0},{"$f":"IF(ISBLANK(A4)=FALSE,VLOOKUP(A4,Adjunct_Table,2,FALSE),0)","v":0},{"$f":"C4*G4","v":0},null,null,null,{"$f":"Main!A41","v":"SGs"},{"$f":"Main!B41","v":1.0686547},{"$f":"Main!D41","v":"Maltose"},null,{"$f":"Main!F41","v":0.41584094752435008}]
[null,{"$f":"IF(ISBLANK(A5)=FALSE,VLOOKUP(A5,Adjunct_Table,3,FALSE),0)","v":0},null,{"$f":"IF(ISBLANK(A5)=FALSE,VLOOKUP(A5,Adjunct_Table,4,FALSE),0)","v":0},0,0,{"$f":"IF(ISBLANK(A5)=FALSE,VLOOKUP(A5,Adjunct_Table,2,FALSE),0)","v":0},0,null,null,null,{"$f":"Main!A42","v":"SGf"},{"$f":"Main!B42","v":1.012},{"$f":"Main!D42","v":"Simple Sugars"},null,{"$f":"Main!F42","v":0.16831810495129979}]
[null,{"$f":"IF(ISBLANK(A6)=FALSE,VLOOKUP(A6,Adjunct_Table,3,FALSE),0)","v":0},null,{"$f":"IF(ISBLANK(A6)=FALSE,VLOOKUP(A6,Adjunct_Table,4,FALSE),0)","v":0},0,0,{"$f":"IF(ISBLANK(A6)=FALSE,VLOOKUP(A6,Adjunct_Table,2,FALSE),0)","v":0},0,null,null,null,{"$f":"Main!A43","v":"SRMb"},{"$f":"Main!B43","v":6.8501088429244907},{"$f":"Main!D43","v":"Other Non-Fermentable Sugars"},{"$f":"Main!E43","v":0},{"$f":"Main!F43","v":0}]
["Non-Fermentable Sugar Adjuncts",null,null,null,null,null,null,null,null,null,null,{"$f":"Main!A44","v":"IBU"},{"$f":"Main!B44","v":67.902567605776866}]
["Name","Unit Gravity","Amount (lbs)","SRMg","SRMext","Gravity","price / lb","ext",null,null,null,{"$f":"Main!A45","v":"% ABV (Miller)"},{"$f":"Main!B45","v":7.5539599999999929E-2}]
[null,{"$f":"IF(ISBLANK(A9)=FALSE,VLOOKUP(A9,Adjunct_Table,3,FALSE),0)","v":0},null,{"$f":"IF(ISBLANK(A9)=FALSE,VLOOKUP(A9,Adjunct_Table,4,FALSE),0)","v":0},{"$f":"IF(ISBLANK(A9),0,C9*D9)","v":0},{"$f":"IF(ISBLANK(A9),0,C9*(B9-1))","v":0},{"$f":"IF(ISBLANK(A9)=FALSE,VLOOKUP(A9,Adjunct_Table,2,FALSE),0)","v":0},{"$f":"C9*G9","v":0}]
[null,{"$f":"IF(ISBLANK(A10)=FALSE,VLOOKUP(A10,Adjunct_Table,3,FALSE),0)","v":0},null,{"$f":"IF(ISBLANK(A10)=FALSE,VLOOKUP(A10,Adjunct_Table,4,FALSE),0)","v":0},{"$f":"IF(ISBLANK(A10),0,C10*D10)","v":0},{"$f":"IF(ISBLANK(A10),0,C10*(B10-1))","v":0},{"$f":"IF(ISBLANK(A10)=FALSE,VLOOKUP(A10,Adjunct_Table,2,FALSE),0)","v":0},{"$f":"C10*G10","v":0}]
[null,{"$f":"IF(ISBLANK(A11)=FALSE,VLOOKUP(A11,Adjunct_Table,3,FALSE),0)","v":0},null,{"$f":"IF(ISBLANK(A11)=FALSE,VLOOKUP(A11,Adjunct_Table,4,FALSE),0)","v":0},0,0,{"$f":"IF(ISBLANK(A11)=FALSE,VLOOKUP(A11,Adjunct_Table,2,FALSE),0)","v":0},0]
[null,{"$f":"IF(ISBLANK(A12)=FALSE,VLOOKUP(A12,Adjunct_Table,3,FALSE),0)","v":0},null,{"$f":"IF(ISBLANK(A12)=FALSE,VLOOKUP(A12,Adjunct_Table,4,FALSE),0)","v":0},0,0,{"$f":"IF(ISBLANK(A12)=FALSE,VLOOKUP(A12,Adjunct_Table,2,FALSE),0)","v":0},0]
[null,{"$f":"IF(ISBLANK(A13)=FALSE,VLOOKUP(A13,Adjunct_Table,3,FALSE),0)","v":0},null,{"$f":"IF(ISBLANK(A13)=FALSE,VLOOKUP(A13,Adjunct_Table,4,FALSE),0)","v":0},{"$f":"IF(ISBLANK(A13),0,C13*D13)","v":0},{"$f":"IF(ISBLANK(A13),0,C13*(B13-1))","v":0},{"$f":"IF(ISBLANK(A13)=FALSE,VLOOKUP(A13,Adjunct_Table,2,FALSE),0)","v":0},{"$f":"C13*G13","v":0}]
[null,null,null,null,null,null,"Total",{"$f":"SUM(H9:H12,H3:H6)","v":1.77}]

{"sheet":"Refractometer","index":4,"n_rows":18,"n_cols":5,"rows_kept":18,"cut":false,"hidden":false,"merged":[]}
["Actual Post Boil Reading"]
[16.399999999999999,"Enter Post Boil Reading"]
[{"$f":"1.000019+0.003865613*(A2)+0.00001296425*(A2*A2)+0.00000005701128*(A2*A2*A2)","v":1.0671533914434481},"Post Boil O.G",null,null,"1.000019+0.003865613*(A8)+0.00001296425*(A8*A8)+0.00000005701128*(A8*A8*A8)"]
[{"$f":"A3+SUM(Adjuncts!F3:F6)/Main!B7","v":1.0739033914434482},"Synthetic O.G. based on adjunct addition post boil."]
[]
[]
["Corrected for After Pitch Sugar Addition"]
[16.399999999999999,"Synthetic Refractometer Reading"]
[{"$f":"1.000019+0.003865613*(A8)+0.00001296425*(A8*A8)+0.00000005701128*(A8*A8*A8)","v":1.0671533914434481},"O.G. (Original Specific Gravity)"]
[]
["Refract Reading","Temp  (in F) If NON ATC","F.G. (Adjusted for Alc and Temp)","Date","Notes"]
[8,68,{"$f":"IF(A12>0,(1.001843-0.002318474*(A$8)-0.000007775*(A$8^2)-0.000000034*(A$8^3)+0.00574*($A12)+0.00003344*($A12^2)+0.000000086*($A12^3))+(1.313454-0.132674*B12+0.002057793*(B12^2)-0.000002627634*(B12^3))*0.001,\"\")","v":1.0106637269221119},null,"Target Reading"]
[7.8,null,1.0097396453760001,"2011-01-06","Primary Ferm Complete"]
[null,null,""]
[null,null,""]
[null,null,""]
[null,null,""]
[null,null,""]

{"sheet":"BatchAnalytics","index":5,"n_rows":13,"n_cols":7,"rows_kept":13,"cut":false,"hidden":false,"merged":[]}
["Grainbill Expense",{"$f":"Grainbill_Total","v":27.7575},null,null,null,"batch price]","Batch Profit"]
["Adjunct Expense",{"$f":"Adjunct_Total","v":1.77}]
["Yeast Expense",{"$f":"SUM(Main!F4:F5)","v":11.3},null,null,null,{"$f":"C13*Main!B7/5","v":160},{"$f":"F3-B5","v":112.7709375}]
["Hops Expense",{"$f":"Hop_Total","v":6.4015625000000007}]
["Batch Total Cost",{"$f":"SUM(B1:B4)","v":47.229062499999998}]
[]
["Gallon Cost",{"$f":"B5/Main!B7","v":4.7229062499999994}]
["Bottle Cost (12oz)",{"$f":"B7/CONVERT(1,\"gal\",\"oz\")*12","v":0.44277246093749995}]
[]
["Package","Cost","Price","Profit / Gal"]
["6pack",{"$f":"B8*6","v":2.6566347656249998},9,{"$f":"(C11-B11)/CONVERT(6*12,\"oz\",\"gal\")","v":11.277093749999999}]
["keg 2.5gal",{"$f":"B7*2.5","v":11.807265624999999},40,{"$f":"(C12-B12)/2.5","v":11.277093750000001}]
["Keg 5gal",{"$f":"B7*5","v":23.614531249999999},80,{"$f":"(C13-B13)/5","v":11.277093750000001}]

{"sheet":"Catalog","index":6,"n_rows":218,"n_cols":6,"rows_kept":218,"cut":false,"hidden":false,"merged":[]}
["Grains and Malts","Price / lb","Unit Gravity","SRMg (Grain)","http://www.homebrewtalk.com/wiki/index.php/Malts_Ch"]
["Pale Malt, Belgian",1.0900000000000001,1.0369999999999999,1.5]
["Carastan (Crystal), 15",1.61,1.0369999999999999,15]
["Wheat Malt (GWM)",1.0900000000000001,1.0369999999999999,3]
["American 2-Row Barley",1.0900000000000001,1.0369999999999999,3]
["Ale Malt, NW (GWM)",1.0900000000000001]
["Munich Malt (GWM)",1.0900000000000001,1.0369999999999999,9]
["Pilsner Malt, Belgian",1.0900000000000001]
["Pilsner Malt, German",1.0900000000000001]
["Vienna Malt (GWM)",1.0900000000000001]
["Pale Malt, Maris Otter",1.0900000000000001]
["6 Row (Briess)",1.0900000000000001,1.0349999999999999,2]
["Acid Malt",1.6]
["Aromatic Malt",1.6,1.036,20]
["Biscuit Malt",1.6]
["Black Patent Malt",1.6]
["Brown Malt (HB)",1.6]
["Caramunich Malt",1.6]
["Caravienne Malt",1.6]
["Chocolate Malt",1.6]
{"$rows_left_out":199}
{"sheet":"Constants","index":7,"n_rows":12,"n_cols":3,"rows_kept":12,"cut":false,"hidden":true,"merged":[]}
[]
["Mash Tmax-crit",155,"deg F"]
["Mash Tmin-crit",145,"deg F"]
[]
["Approximate Brewhouse Efficiency",0.67600000000000016]
[]
[]
[]
[]
["Hops Usages","Bittering"]
[null,"Aroma"]
[null,"Dual"]

{"sheet":"Scratch","index":8,"n_rows":31,"n_cols":16,"rows_kept":31,"cut":false,"hidden":true,"merged":[]}
[null,"modified from Tom M's Acid Addition Calculation Sheet (palmer 10/2006)"]
[]
[null,null,null,null,null,null,null,null,null,"ppm as CaCO3"]
["Carbonate Ratio at (_) pH",null,null,null,"H2CO3","HCO3-","CO3--",null,null,"HCO3 ppm (if pH<8.4)"]
["ph","r1","r2","d","f1","f2","f3"]
[{"$f":"Mash!B43","v":8},{"$f":"10^(A6-6.38)","v":41.686938347033561},{"$f":"10^(A6-10.33)","v":4.6773514128719777E-3},{"$f":"1+B6+B6*C6","v":42.881922807009367},{"$f":"1/D6","v":2.3319849823444545E-2},{"$f":"B6/D6","v":0.97213314185201416},{"$f":"B6*C6/D6","v":4.5470083245411934E-3}]
[{"$f":"Mash!C43","v":6},{"$f":"10^(Mash!C44-6.38)","v":4.1686938347033493E-7},{"$f":"10^(Mash!C44-10.33)","v":4.6773514128719782E-11},{"$f":"1+B7+B7*C7","v":1.0000004168693835},{"$f":"1/D7","v":0.99999958313079029},{"$f":"B7/D7","v":4.1686920969032448E-7},{"$f":"B7*C7/D7","v":1.9498437869278643E-17},null,null,"Alkalinity as CaCO3"]
[4.3,{"$f":"10^(4.3-6.38)","v":8.3176377110267055E-3},{"$f":"10^(4.3-10.33)","v":9.3325430079699009E-7},{"$f":"1+B8+B8*C8","v":1.0083176454734979},{"$f":"1/D8","v":0.9917509670580128},{"$f":"B8/D8","v":8.2490252435489311E-3},{"$f":"B8*C8/D8","v":7.6984382859249789E-9},null,null,"Bicarbonate (ppm)"]
[]
[null,null,null,null,null,null,null,"ct"]
[null,"Calculated values"]
[null,"Total Alkalinity",null,{"$f":"IF(Mash!E14=\"Alkalinity as CaCO3\",Mash!E19,Mash!E19*50/61)","v":0}]
[null,"    converted to mEq/L",null,{"$f":"D12/50","v":0},"mEq/L"]
[null,"Carbo system at pH =",null,{"$f":"Mash!B43","v":8}]
[null,"% of Carbo as H2CO3",null,{"$f":"E6","v":2.3319849823444545E-2}]
[null,"% of Carbo as HCO3-",null,{"$f":"F6","v":0.97213314185201416}]
[null,"% of Carbo as CO3--",null,{"$f":"G6","v":4.5470083245411934E-3}]
[null,"Carbo system at pH =",null,{"$f":"Mash!C43","v":6}]
[null,"% of Carbo as H2CO3",null,{"$f":"E7","v":0.99999958313079029}]
[null,"% of Carbo as HCO3-",null,{"$f":"F7","v":4.1686920969032448E-7}]
{"$rows_left_out":12}
{"sheet":"Mash","index":9,"n_rows":47,"n_cols":21,"rows_kept":47,"cut":false,"hidden":false,"merged":[[30,1,30,7],[35,1,35,8],[19,1,19,11],[4,1,4,14],[0,1,0,8],[11,1,11,7],[15,1,15,7],[23,1,23,7]]}
[null,"Mash Residual Alkalinity Adjustment Worksheet Version 2.4 (US Units)"]
[null,null,null,"User Input",null,null,"by John Palmer All Rights Reserved 2008"]
[null,null,null,"Calc. Output",null,"Units are grams, gallons, and milliliters. "]
[]
[null,"Step 1: Enter Target Beer Color to see range of suggested Residual Alkalinity, Or Enter a Target Water Profile to see its calculated Residual Alkalinity value and a range of suggested Beer Color. (Choose either \"Bicarbonate\" or \"Total Alkalinity\" in E10 and enter the appropriate value in E11.)"]
[null,"Target Color (SRM)","Est. RA (Low)","Est. RA (High)"]
[null,3,{"$f":"B7*12.2-122.4","v":-85.800000000000011},{"$f":"(B7-5.2)*12.2","v":-26.84}]
[null,null,null,null,null,null,null,null,null,null,null,null,null,null,null,null,null,null,null,"Ratio","Balance"]
[null,"Target Water","Calcium (ppm)","Magnesium (ppm)","Alkalinity as CaCO3","Sodium (ppm)","Chloride (ppm)","Sulfate (ppm)",null,null,"(Effective Hardness)","Residual Alkalinity as CaCO3","Est. SRM (Low)","Est. SRM (High)","Chloride to Sulfate Balance",null,null,null,null,0,"Very Bitter"]
[null,"(ppm)",0,0,0,0,0,0,null,null,{"$f":"(C10/1.4)+(D10/1.7)","v":0},{"$f":"IF(E9=\"Bicarbonate (ppm)\", (50*E10/61)-K10, E10-K10)","v":0},{"$f":"IF(L10<-69,0,L10*0.082+5.2)","v":5.2},{"$f":"IF(L10<-128,0,(L10+122.4)/12.2)","v":10.032786885245903},{"$f":"VLOOKUP(G10/H10,T9:U13, 2, TRUE)","v":{"$error":"#DIV/0!"}},null,null,null,null,0.501,"Bitter"]
[null,null,null,null,null,null,null,null,null,null,null,null,null,null,null,null,null,null,null,0.76800000000000002,"Balanced"]
[null,"Step 2: Enter Source Water Profile. (Choose \"Bicarbonate\" or \"Alkalinity\" in E14.)",null,null,null,null,null,null,null,null,null,null,null,null,null,null,null,null,null,1.3,"Malty"]
[null,"Source Water","Calcium (ppm)","Magnesium (ppm)","Alkalinity as CaCO3","Sodium (ppm)","Chloride (ppm)","Sulfate (ppm)","Water pH",null,"(Effective Hardness)","Residual Alkalinity as CaCO3","Est. SRM (Low)","Est. SRM (High)","Chloride to Sulfate Ratio",null,null,null,null,2.0099999999999998,"Very Malty"]
[null,"(ppm)",51,16,190,66,63,120,8.1,null,{"$f":"(C14/1.4)+(D14/1.7)","v":45.840336134453786},{"$f":"IF(E13=\"Bicarbonate (ppm)\", (50*E14/61)-K14, E14-K14)","v":144.15966386554621},{"$f":"IF(L14<-69,0,L14*0.082+5.2)","v":17.02109243697479},{"$f":"IF(L14<-128,0,(L14+122.4)/12.2)","v":21.849152775864447},{"$f":"VLOOKUP(G14/H14,T9:U13, 2, TRUE)","v":"Bitter"}]
[]
[null,"Step 3: Optional: Dilute Source Water with Distilled Water (Enter Zero if not diluting.) "]
[null,"Dilution Rate","Calcium (ppm)","Magnesium (ppm)",{"$f":"E13","v":"Alkalinity as CaCO3"},"Sodium (ppm)","Chloride (ppm)","Sulfate (ppm)",null,null,"(Effective Hardness)","Residual Alkalinity as CaCO3","Est. SRM (Low)","Est. SRM (High)","Chloride to Sulfate Ratio"]
[null,0,{"$f":"(1-$B18)*C14","v":51},16,190,66,63,120,null,null,{"$f":"(C18/1.4)+(D18/1.7)","v":45.840336134453786},{"$f":"IF(E17=\"Bicarbonate (ppm)\", (50*E18/61)-K18, E18-K18)","v":144.15966386554621},{"$f":"IF(L18<-69,0,L18*0.082+5.2)","v":17.02109243697479},{"$f":"IF(L18<-128,0,(L18+122.4)/12.2)","v":21.849152775864447},{"$f":"VLOOKUP(G18/H18,T9:U13, 2, TRUE)","v":"Bitter"}]
[]
[null,"Step 4: Enter a Target Residual Alkalinity Value, based on Step 1, and the total volume of mash water."]
{"$rows_left_out":27}